{"text_format":"1","workbook":"xlsx","n_sheets":29,"sheets":["Instructions","P1","P2","CCA","V1","PTA","V2","D#1","D#2","D#3","D#4","D#5","D#6","D#7","D#8","D#9","D#10","CAPEX","V","TS","IS","BS","CF","DS","RA","A1","A2","A3","Notes"],"not_rendered":{"charts":0,"images":0,"macros":1,"external_links":2,"defined_names":18,"comments":3,"pivot_tables":0},"unopened":[],"bounds":{"document_bytes":16777216,"sheet_cells":100000,"rows_first":2000,"rows_last":500,"rows_between":2000,"halvings":0,"cell_chars":16384,"cell_head_chars":4096},"cells_cut":0,"cells_raw":0,"read":"whole","date_system":"1900"}

{"sheet":"Instructions","index":0,"n_rows":18,"n_cols":3,"rows_kept":18,"cut":false,"hidden":false,"merged":[]}
[]
[null,"Tickers","<---Hover mouse over cells with this red triangle on Page 1 for instructions. "]
[null,"Type tickers into Page 1 based on market capitalization. "]
[null,"Spreadsheet only works on a Bloomberg terminal with Blomberg Excel add-in enabled."]
[]
[null,"Author:","Nathan Ramos, Chief Executive Officer"]
{"$rows_left_out":13}
{"sheet":"P1","index":1,"n_rows":52,"n_cols":20,"rows_kept":52,"cut":false,"hidden":false,"merged":[[4,13,4,19],[4,9,4,12],[4,4,4,8],[4,2,4,3],[5,17,5,19],[5,15,5,16],[5,13,5,14]]}
[{"$f":"A9","v":"OLD DOMINION FREIGHT LINE"}]
["Benchmarking Analysis - Financial Statistics and Ratios, Page 1"]
["($ in millions, except per share data)"]
[]
[null,null,"Market Valuation",null,"LTM Financial Statistics",null,null,null,null,"LTM Profitability Margins",null,null,null,"Growth Rates"]
[null,null,null,null,null,null,null,null,null,"Gross",null,null,"Net","Sales",null,"EBITDA",null,"EPS"]
{"$rows_left_out":47}
{"sheet":"P2","index":2,"n_rows":53,"n_cols":16,"rows_kept":53,"cut":false,"hidden":false,"merged":[[4,2,4,3],[4,14,4,15],[4,11,4,13],[4,8,4,10],[4,4,4,7]]}
[{"$f":"A9","v":"OLD DOMINION FREIGHT LINE"}]
["Benchmarking Analysis - Financial Statistics and Ratios, Page 2"]
["($ in millions, except per share data)"]
[]
[null,null,"Market Valuation",null,"Return on Investment",null,null,null,"LTM Leverage Ratios",null,null,"LTM Coverage Ratios",null,null,"Credit Ratings"]
[null,null,null,null,null,null,null,"Implied","Debt /","Debt /","Net Debt /","EBITDA /","EBITDA","EBIT /"]
{"$rows_left_out":48}
{"sheet":"CCA","index":3,"n_rows":52,"n_cols":21,"rows_kept":52,"cut":false,"hidden":false,"merged":[[4,17,4,19],[4,6,4,14]]}
[{"$f":"'P1'!A1","v":"OLD DOMINION FREIGHT LINE"}]
["Comparable Companies Analysis"]
["($ in millions, except per share data)"]
[]
[null,null,"Current","% of",null,null,"Enterprise Value /",null,null,null,null,null,null,null,null,"LTM","Total","Price /",null,null,"LT"]
[null,null,"Share","52-wk.","Equity","Enterprise","LTM",{"$f":"YEAR('P2'!$C$12)+1&\"E\"","v":"2017E"},{"$f":"YEAR('P2'!$C$12)+2&\"E\"","v":"2018E"},"LTM",{"$f":"YEAR('P2'!$C$12)+1&\"E\"","v":"2017E"},{"$f":"YEAR('P2'!$C$12)+2&\"E\"","v":"2018E"},"LTM",{"$f":"YEAR('P2'!$C$12)+1&\"E\"","v":"2017E"},{"$f":"YEAR('P2'!$C$12)+2&\"E\"","v":"2018E"},"EBITDA","Debt /","LTM",{"$f":"YEAR('P2'!$C$12)+1&\"E\"","v":"2017E"},{"$f":"YEAR('P2'!$C$12)+2&\"E\"","v":"2018E"},"EPS"]
{"$rows_left_out":47}
{"sheet":"V1","index":4,"n_rows":21,"n_cols":12,"rows_kept":21,"cut":false,"hidden":false,"merged":[[5,2,5,3],[4,9,4,11],[4,6,4,8],[10,6,10,8],[10,9,10,11],[5,9,5,11],[5,6,5,8],[17,2,17,3],[17,6,17,8],[17,9,17,11],[11,2,11,3],[11,6,11,8],[11,9,11,11],[16,6,16,8],[16,9,16,11]]}
[{"$f":"'P1'!A1","v":"OLD DOMINION FREIGHT LINE"}]
["Comparable Companies Analysis"]
[{"$f":"CONCATENATE(\"($ in millions, LTM \",_xll.BDP(\"luv equity\",\"fundamental database date\"),\")\")","v":{"$error":"#NAME?"}}]
[]
[null,null,null,null,null,null,"Implied Range",null,null,"Implied Enterprise Value"]
["Sales","Metric","Multiple Range",null,"Average","Median","Enterprise Value Range",null,null,"Average / Median"]
{"$rows_left_out":16}
{"sheet":"PTA","index":5,"n_rows":23,"n_cols":15,"rows_kept":23,"cut":false,"hidden":false,"merged":[[4,12,4,14],[4,7,4,9],[5,12,5,14]]}
[{"$f":"'P1'!A1","v":"OLD DOMINION FREIGHT LINE"}]
["Precedent Transactions Analysis"]
["($ in millions)"]
[]
[null,null,null,null,null,null,null,"Enterprise Value /",null,null,"LTM","Equity Value /","Premiums Paid"]
["Date",null,null,"Deal","Payment","Equity","Enterprise","LTM","LTM","LTM","EBITDA","LTM","Days Prior to Unaffected"]
{"$rows_left_out":18}
{"sheet":"V2","index":6,"n_rows":15,"n_cols":12,"rows_kept":15,"cut":false,"hidden":false,"merged":[[4,6,4,8],[4,9,4,11],[5,2,5,3],[5,6,5,8],[5,9,5,11],[8,6,8,8],[8,9,8,11],[13,2,13,3],[13,6,13,8],[13,9,13,11],[9,2,9,3],[9,6,9,8],[9,9,9,11],[12,6,12,8],[12,9,12,11]]}
[{"$f":"'P1'!A1","v":"OLD DOMINION FREIGHT LINE"}]
["Implied Valuation Range"]
[{"$f":"CONCATENATE(\"($ in millions, LTM \",_xll.BDP(\"luv equity\",\"fundamental database date\"),\")\")","v":{"$error":"#NAME?"}}]
[]
[null,null,null,null,null,null,"Implied",null,null,"Implied Enterprise Value"]
["Sales","Metric","Multiple Range",null,"Average","Median","Enterprise Value Range",null,null,"Average / Median"]
{"$rows_left_out":10}
{"sheet":"D#1","index":7,"n_rows":36,"n_cols":14,"rows_kept":36,"cut":false,"hidden":false,"merged":[]}
[{"$f":"PTA!D8&\" of \"&PTA!C8&\" by \"&PTA!B8","v":"Cross Border, Company Takeover of ZF TRW Automotive Holdings Corp by ZF Friedrichshafen AG"}]
["Deal Analysis"]
["($ in millions, except per share data)"]
["Target Company Ticker",null,null,"TRW",null,null,null,null,null,null,null,null,"Quarter","Year"]
["Target Company Name",null,null,{"$f":"_xll.BDP(D4&\" Equity\",\"Security Name\")","v":{"$error":"#NAME?"}},null,null,null,null,null,null,null,"Prior Quarter Before Deal Announcement",{"$f":"IF(MONTH(EOMONTH(E33,-3))<=3,\"Q1\",IF(MONTH(EOMONTH(E33,-3))<=6,\"Q2\",IF(MONTH(EOMONTH(E33,-3))<=9,\"Q3\",IF(MONTH(EOMONTH(E33,-3))<=12,\"Q4\"))))","v":"Q2"},{"$f":"YEAR(EOMONTH(E33,-3))","v":2014}]
[]
{"$rows_left_out":31}
{"sheet":"D#2","index":8,"n_rows":36,"n_cols":14,"rows_kept":36,"cut":false,"hidden":false,"merged":[]}
[{"$f":"PTA!D9&\" of \"&PTA!C9&\" by \"&PTA!B9","v":"Company Takeover of American Axle & Manufacturing Holdings Inc by Metaldyne Performance Group Inc"}]
["Deal Analysis"]
["($ in millions, except per share data)"]
["Target Company Ticker",null,null,"MPG",null,null,null,null,null,null,null,null,"Quarter","Year"]
["Target Company Name",null,null,{"$f":"_xll.BDP(D4&\" Equity\",\"Security Name\")","v":{"$error":"#NAME?"}},null,null,null,null,null,null,null,"Prior Quarter Before Deal Announcement",{"$f":"IF(MONTH(EOMONTH(E33,-3))<=3,\"Q1\",IF(MONTH(EOMONTH(E33,-3))<=6,\"Q2\",IF(MONTH(EOMONTH(E33,-3))<=9,\"Q3\",IF(MONTH(EOMONTH(E33,-3))<=12,\"Q4\"))))","v":"Q3"},{"$f":"YEAR(EOMONTH(E33,-3))","v":2016}]
[]
{"$rows_left_out":31}
{"sheet":"D#3","index":9,"n_rows":36,"n_cols":14,"rows_kept":36,"cut":false,"hidden":false,"merged":[]}
[{"$f":"PTA!D10&\" of \"&PTA!C10&\" by \"&PTA!B10","v":" of  by "}]
["Deal Analysis"]
["($ in millions, except per share data)"]
["Target Company Ticker",null,null,"HAYL",null,null,null,null,null,null,null,null,"Quarter","Year"]
["Target Company Name",null,null,{"$f":"_xll.BDP(D4&\" Equity\",\"Security Name\")","v":{"$error":"#NAME?"}},null,null,null,null,null,null,null,"Prior Quarter Before Deal Announcement",{"$f":"IF(MONTH(EOMONTH(E33,-3))<=3,\"Q1\",IF(MONTH(EOMONTH(E33,-3))<=6,\"Q2\",IF(MONTH(EOMONTH(E33,-3))<=9,\"Q3\",IF(MONTH(EOMONTH(E33,-3))<=12,\"Q4\"))))","v":{"$error":"#NUM!"}},{"$f":"YEAR(EOMONTH(E33,-3))","v":{"$error":"#NUM!"}}]
[]
{"$rows_left_out":31}
{"sheet":"D#4","index":10,"n_rows":36,"n_cols":14,"rows_kept":36,"cut":false,"hidden":false,"merged":[]}
[{"$f":"PTA!D11&\" of \"&PTA!C11&\" by \"&PTA!B11","v":" of  by "}]
["Deal Analysis"]
["($ in millions, except per share data)"]
["Target Company Ticker",null,null,"GLBC",null,null,null,null,null,null,null,null,"Quarter","Year"]
["Target Company Name",null,null,{"$f":"_xll.BDP(D4&\" Equity\",\"Security Name\")","v":{"$error":"#NAME?"}},null,null,null,null,null,null,null,"Prior Quarter Before Deal Announcement",{"$f":"IF(MONTH(EOMONTH(E33,-3))<=3,\"Q1\",IF(MONTH(EOMONTH(E33,-3))<=6,\"Q2\",IF(MONTH(EOMONTH(E33,-3))<=9,\"Q3\",IF(MONTH(EOMONTH(E33,-3))<=12,\"Q4\"))))","v":{"$error":"#NUM!"}},{"$f":"YEAR(EOMONTH(E33,-3))","v":{"$error":"#NUM!"}}]
[]
{"$rows_left_out":31}
{"sheet":"D#5","index":11,"n_rows":36,"n_cols":14,"rows_kept":36,"cut":false,"hidden":false,"merged":[]}
[{"$f":"PTA!D12&\" of \"&PTA!C12&\" by \"&PTA!B12","v":" of  by "}]
["Deal Analysis"]
["($ in millions, except per share data)"]
["Target Company Ticker",null,null,"PAET",null,null,null,null,null,null,null,null,"Quarter","Year"]
["Target Company Name",null,null,{"$f":"_xll.BDP(D4&\" Equity\",\"Security Name\")","v":{"$error":"#NAME?"}},null,null,null,null,null,null,null,"Prior Quarter Before Deal Announcement",{"$f":"IF(MONTH(EOMONTH(E33,-3))<=3,\"Q1\",IF(MONTH(EOMONTH(E33,-3))<=6,\"Q2\",IF(MONTH(EOMONTH(E33,-3))<=9,\"Q3\",IF(MONTH(EOMONTH(E33,-3))<=12,\"Q4\"))))","v":{"$error":"#NUM!"}},{"$f":"YEAR(EOMONTH(E33,-3))","v":{"$error":"#NUM!"}}]
[]
{"$rows_left_out":31}
{"sheet":"D#6","index":12,"n_rows":36,"n_cols":14,"rows_kept":36,"cut":false,"hidden":false,"merged":[]}
[{"$f":"PTA!D13&\" of \"&PTA!C13&\" by \"&PTA!B13","v":" of  by "}]
["Deal Analysis"]
["($ in millions, except per share data)"]
["Target Company Ticker",null,null,"HUGH",null,null,null,null,null,null,null,null,"Quarter","Year"]
["Target Company Name",null,null,{"$f":"_xll.BDP(D4&\" Equity\",\"Security Name\")","v":{"$error":"#NAME?"}},null,null,null,null,null,null,null,"Prior Quarter Before Deal Announcement",{"$f":"IF(MONTH(EOMONTH(E33,-3))<=3,\"Q1\",IF(MONTH(EOMONTH(E33,-3))<=6,\"Q2\",IF(MONTH(EOMONTH(E33,-3))<=9,\"Q3\",IF(MONTH(EOMONTH(E33,-3))<=12,\"Q4\"))))","v":{"$error":"#NUM!"}},{"$f":"YEAR(EOMONTH(E33,-3))","v":{"$error":"#NUM!"}}]
[]
{"$rows_left_out":31}
{"sheet":"D#7","index":13,"n_rows":36,"n_cols":14,"rows_kept":36,"cut":false,"hidden":false,"merged":[]}
[{"$f":"PTA!D14&\" of \"&PTA!C14&\" by \"&PTA!B14","v":" of  by "}]
["Deal Analysis"]
["($ in millions, except per share data)"]
["Target Company Ticker",null,null,"FRP",null,null,null,null,null,null,null,null,"Quarter","Year"]
["Target Company Name",null,null,{"$f":"_xll.BDP(D4&\" Equity\",\"Security Name\")","v":{"$error":"#NAME?"}},null,null,null,null,null,null,null,"Prior Quarter Before Deal Announcement",{"$f":"IF(MONTH(EOMONTH(E33,-3))<=3,\"Q1\",IF(MONTH(EOMONTH(E33,-3))<=6,\"Q2\",IF(MONTH(EOMONTH(E33,-3))<=9,\"Q3\",IF(MONTH(EOMONTH(E33,-3))<=12,\"Q4\"))))","v":{"$error":"#NUM!"}},{"$f":"YEAR(EOMONTH(E33,-3))","v":{"$error":"#NUM!"}}]
[]
{"$rows_left_out":31}
{"sheet":"D#8","index":14,"n_rows":36,"n_cols":14,"rows_kept":36,"cut":false,"hidden":false,"merged":[]}
[{"$f":"PTA!D15&\" of \"&PTA!C15&\" by \"&PTA!B15","v":" of  by "}]
["Deal Analysis"]
["($ in millions, except per share data)"]
["Target Company Ticker",null,null,"RCNI",null,null,null,null,null,null,null,null,"Quarter","Year"]
["Target Company Name",null,null,{"$f":"_xll.BDP(D4&\" Equity\",\"Security Name\")","v":{"$error":"#NAME?"}},null,null,null,null,null,null,null,"Prior Quarter Before Deal Announcement",{"$f":"IF(MONTH(EOMONTH(E33,-3))<=3,\"Q1\",IF(MONTH(EOMONTH(E33,-3))<=6,\"Q2\",IF(MONTH(EOMONTH(E33,-3))<=9,\"Q3\",IF(MONTH(EOMONTH(E33,-3))<=12,\"Q4\"))))","v":{"$error":"#NUM!"}},{"$f":"YEAR(EOMONTH(E33,-3))","v":{"$error":"#NUM!"}}]
[]
{"$rows_left_out":31}
{"sheet":"D#9","index":15,"n_rows":36,"n_cols":14,"rows_kept":36,"cut":false,"hidden":false,"merged":[]}
[{"$f":"PTA!D16&\" of \"&PTA!C16&\" by \"&PTA!B16","v":" of  by "}]
["Deal Analysis"]
["($ in millions, except per share data)"]
["Target Company Ticker",null,null,"IWA",null,null,null,null,null,null,null,null,"Quarter","Year"]
["Target Company Name",null,null,{"$f":"_xll.BDP(D4&\" Equity\",\"Security Name\")","v":{"$error":"#NAME?"}},null,null,null,null,null,null,null,"Prior Quarter Before Deal Announcement",{"$f":"IF(MONTH(EOMONTH(E33,-3))<=3,\"Q1\",IF(MONTH(EOMONTH(E33,-3))<=6,\"Q2\",IF(MONTH(EOMONTH(E33,-3))<=9,\"Q3\",IF(MONTH(EOMONTH(E33,-3))<=12,\"Q4\"))))","v":{"$error":"#NUM!"}},{"$f":"YEAR(EOMONTH(E33,-3))","v":{"$error":"#NUM!"}}]
[]
{"$rows_left_out":31}
{"sheet":"D#10","index":16,"n_rows":36,"n_cols":14,"rows_kept":36,"cut":false,"hidden":false,"merged":[]}
[{"$f":"PTA!D17&\" of \"&PTA!C17&\" by \"&PTA!B17","v":" of  by "}]
["Deal Analysis"]
["($ in millions, except per share data)"]
["Target Company Ticker",null,null,"ELNK",null,null,null,null,null,null,null,null,"Quarter","Year"]
["Target Company Name",null,null,{"$f":"_xll.BDP(D4&\" Equity\",\"Security Name\")","v":{"$error":"#NAME?"}},null,null,null,null,null,null,null,"Prior Quarter Before Deal Announcement",{"$f":"IF(MONTH(EOMONTH(E33,-3))<=3,\"Q1\",IF(MONTH(EOMONTH(E33,-3))<=6,\"Q2\",IF(MONTH(EOMONTH(E33,-3))<=9,\"Q3\",IF(MONTH(EOMONTH(E33,-3))<=12,\"Q4\"))))","v":{"$error":"#NUM!"}},{"$f":"YEAR(EOMONTH(E33,-3))","v":{"$error":"#NUM!"}}]
[]
{"$rows_left_out":31}
{"sheet":"CAPEX","index":17,"n_rows":17,"n_cols":6,"rows_kept":17,"cut":false,"hidden":false,"merged":[]}
[{"$f":"TS!A1","v":"OLD DOMINION FREIGHT LINE"}]
["Capital Expenditures Adjustments"]
[{"$f":"CONCATENATE(\"$ in millions, fiscal year ending \",_xll.BDP('P1'!B9&\" Equity\",\"CURRENT FULL FISCAL YEAR END\"))","v":{"$error":"#NAME?"}}]
[null,null,null,null,"LTM","Pro Forma"]
[null,{"$f":"IS!B6","v":{"$error":"#NAME?"}},{"$f":"IS!C6","v":{"$error":"#NAME?"}},{"$f":"IS!D6","v":{"$error":"#NAME?"}},{"$f":"IS!E6","v":{"$error":"#NAME?"}},{"$f":"IS!F6","v":{"$error":"#NAME?"}}]
["Sales",{"$f":"IS!B7","v":{"$error":"#NAME?"}},{"$f":"IS!C7","v":{"$error":"#NAME?"}},{"$f":"IS!D7","v":{"$error":"#NAME?"}},{"$f":"IS!E7","v":{"$error":"#NAME?"}},{"$f":"IS!F7","v":{"$error":"#NAME?"}}]
{"$rows_left_out":12}
{"sheet":"V","index":18,"n_rows":15,"n_cols":9,"rows_kept":15,"cut":false,"hidden":false,"merged":[[0,1,0,3],[8,1,8,3]]}
[null,"Enterprise Value"]
["Method","Pessimistic Valuation","Base Valuation","Optimistic Valuation",null,null,null,"Existing Short-Term Debt",{"$f":"BS!B23","v":{"$error":"#NAME?"}}]
["Comparable Companies Analysis",{"$f":"CCA!L11*'P1'!G9","v":9218.8961426342285},{"$f":"CCA!K11*'P1'!G9","v":10150.097773203343},{"$f":"CCA!J11*'P1'!G9","v":9936.4088941103946},null,null,null,"Existing Long Term Borrowing",{"$f":"BS!B33","v":{"$error":"#NAME?"}}]
["Precedent Transactions Analysis",{"$f":"'V2'!G11","v":0},{"$f":"'V2'!L11","v":{"$error":"#NUM!"}},{"$f":"'V2'!I11","v":0},null,null,null,"Noncontrolling Interest",{"$f":"BS!B37","v":{"$error":"#NAME?"}}]
["Discounted Cash Flow Analysis",5065,5773,6538,null,null,null,"Financial Subsidiary Adjustment",{"$f":"IFERROR(-_xll.BDP('P1'!$B$9&\" Equity\",\"ENTERPRISE VALUE ADJUSTMENT\",\"FUND PER=Q\"),0)","v":0}]
["Consensus Analyst Target Price",{"$f":"_xll.BDP('P1'!$B$9&\" Equity\",\"BEST TARGET LO\")*'A3'!$L$27+SUM(I2:I4)-SUM(I5:I6)","v":{"$error":"#NAME?"}},{"$f":"_xll.BDP('P1'!$B$9&\" Equity\",\"BEST TARGET MEDIAN\")*'A3'!$L$27+SUM(I2:I4)-SUM(I5:I6)","v":{"$error":"#NAME?"}},{"$f":"_xll.BDP('P1'!$B$9&\" Equity\",\"BEST TARGET HI\")*'A3'!$L$27+SUM(I2:I4)-SUM(I5:I6)","v":{"$error":"#NAME?"}},null,null,null,"Cash and Marketable Securities",{"$f":"BS!B8","v":{"$error":"#NAME?"}}]
{"$rows_left_out":10}
{"sheet":"TS","index":19,"n_rows":74,"n_cols":16,"rows_kept":74,"cut":false,"hidden":false,"merged":[[22,1,22,4],[22,6,22,15],[6,0,6,5],[6,6,6,9],[6,10,6,12],[13,13,13,15],[6,13,6,15],[13,10,13,12],[7,3,7,4]]}
[{"$f":"'P1'!A1","v":"OLD DOMINION FREIGHT LINE"}]
["Leveraged Buyout Analysis"]
[{"$f":"CONCATENATE(\"$ in millions, fiscal year ending \",_xll.BDP('P1'!B9&\" Equity\",\"CURRENT FULL FISCAL YEAR END\"))","v":{"$error":"#NAME?"}}]
[]
["Transaction Summary"]
[]
{"$rows_left_out":69}
{"sheet":"IS","index":20,"n_rows":55,"n_cols":16,"rows_kept":55,"cut":false,"hidden":false,"merged":[[3,1,3,4],[3,6,3,15]]}
[{"$f":"'P1'!A1","v":"OLD DOMINION FREIGHT LINE"}]
["Income Statement"]
[{"$f":"CONCATENATE(\"$ in millions, fiscal year ending \",_xll.BDP('P1'!B9&\" Equity\",\"CURRENT FULL FISCAL YEAR END\"))","v":{"$error":"#NAME?"}}]
[null,"Historical Period",null,null,null,null,"Projection Period"]
[null,null,null,null,"LTM","Pro Forma","Year 1","Year 2","Year 3","Year 4","Year 5","Year 6","Year 7","Year 8","Year 9","Year 10"]
[null,{"$f":"TS!B25","v":{"$error":"#NAME?"}},{"$f":"TS!C25","v":{"$error":"#NAME?"}},{"$f":"TS!D25","v":{"$error":"#NAME?"}},{"$f":"TS!E25","v":{"$error":"#NAME?"}},{"$f":"YEAR(E6)","v":{"$error":"#NAME?"}},{"$f":"F6+1","v":{"$error":"#NAME?"}},{"$error":"#NAME?"},{"$error":"#NAME?"},{"$error":"#NAME?"},{"$error":"#NAME?"},{"$error":"#NAME?"},{"$error":"#NAME?"},{"$error":"#NAME?"},{"$error":"#NAME?"},{"$error":"#NAME?"}]
{"$rows_left_out":50}
{"sheet":"BS","index":21,"n_rows":59,"n_cols":15,"rows_kept":59,"cut":false,"hidden":false,"merged":[[3,5,3,14],[4,2,4,3]]}
[{"$f":"'P1'!A1","v":"OLD DOMINION FREIGHT LINE"}]
["Balance Sheet"]
[{"$f":"CONCATENATE(\"$ in millions, fiscal year ending \",_xll.BDP('P1'!B9&\" Equity\",\"CURRENT FULL FISCAL YEAR END\"))","v":{"$error":"#NAME?"}}]
[null,null,null,null,null,"Projection Period"]
[null,"Opening","Adjustments",null,"Pro Forma","Year 1","Year 2","Year 3","Year 4","Year 5","Year 6","Year 7","Year 8","Year 9","Year 10"]
[null,{"$f":"IS!F6","v":{"$error":"#NAME?"}},"+","-",{"$f":"B6","v":{"$error":"#NAME?"}},{"$f":"E6+1","v":{"$error":"#NAME?"}},{"$error":"#NAME?"},{"$error":"#NAME?"},{"$error":"#NAME?"},{"$error":"#NAME?"},{"$error":"#NAME?"},{"$error":"#NAME?"},{"$error":"#NAME?"},{"$error":"#NAME?"},{"$error":"#NAME?"}]
{"$rows_left_out":54}
{"sheet":"CF","index":22,"n_rows":48,"n_cols":16,"rows_kept":48,"cut":false,"hidden":false,"merged":[[3,6,3,15]]}
[{"$f":"'P1'!A1","v":"OLD DOMINION FREIGHT LINE"}]
["Cash Flow Statement"]
[{"$f":"CONCATENATE(\"$ in millions, fiscal year ending \",_xll.BDP('P1'!B9&\" Equity\",\"CURRENT FULL FISCAL YEAR END\"))","v":{"$error":"#NAME?"}}]
[null,null,null,null,null,null,"Projection Period"]
[null,null,null,null,null,null,"Year 1","Year 2","Year 3","Year 4","Year 5","Year 6","Year 7","Year 8","Year 9","Year 10"]
[null,null,null,null,null,null,{"$f":"BS!F6","v":{"$error":"#NAME?"}},{"$f":"G6+1","v":{"$error":"#NAME?"}},{"$error":"#NAME?"},{"$error":"#NAME?"},{"$error":"#NAME?"},{"$error":"#NAME?"},{"$error":"#NAME?"},{"$error":"#NAME?"},{"$error":"#NAME?"},{"$error":"#NAME?"}]
{"$rows_left_out":43}
{"sheet":"DS","index":23,"n_rows":133,"n_cols":16,"rows_kept":133,"cut":false,"hidden":false,"merged":[[3,6,3,15]]}
[{"$f":"'P1'!A1","v":"OLD DOMINION FREIGHT LINE"}]
["Debt Schedule"]
[{"$f":"CONCATENATE(\"$ in millions, fiscal year ending \",_xll.BDP('P1'!B9&\" Equity\",\"CURRENT FULL FISCAL YEAR END\"))","v":{"$error":"#NAME?"}}]
[null,null,null,null,null,null,"Projection Period"]
[null,null,null,null,null,{"$f":"TS!F24","v":"Pro Forma"},"Year 1","Year 2","Year 3","Year 4","Year 5","Year 6","Year 7","Year 8","Year 9","Year 10"]
["Bloomberg function <FWCV>",null,null,null,null,{"$f":"TS!F25","v":{"$error":"#NAME?"}},{"$f":"BS!F6","v":{"$error":"#NAME?"}},{"$f":"G6+1","v":{"$error":"#NAME?"}},{"$error":"#NAME?"},{"$error":"#NAME?"},{"$error":"#NAME?"},{"$error":"#NAME?"},{"$error":"#NAME?"},{"$error":"#NAME?"},{"$error":"#NAME?"},{"$error":"#NAME?"}]
{"$rows_left_out":128}
{"sheet":"RA","index":24,"n_rows":43,"n_cols":14,"rows_kept":43,"cut":false,"hidden":false,"merged":[[3,4,3,13]]}
[{"$f":"'P1'!A1","v":"OLD DOMINION FREIGHT LINE"}]
["Returns Analysis"]
[{"$f":"CONCATENATE(\"$ in millions, fiscal year ending \",_xll.BDP('P1'!B9&\" Equity\",\"CURRENT FULL FISCAL YEAR END\"))","v":{"$error":"#NAME?"}}]
[null,null,null,null,"Projection Period"]
[null,null,null,{"$f":"TS!F24","v":"Pro Forma"},"Year 1","Year 2","Year 3","Year 4","Year 5","Year 6","Year 7","Year 8","Year 9","Year 10"]
[null,null,null,{"$f":"TS!F25","v":{"$error":"#NAME?"}},{"$f":"BS!F6","v":{"$error":"#NAME?"}},{"$f":"E6+1","v":{"$error":"#NAME?"}},{"$error":"#NAME?"},{"$error":"#NAME?"},{"$error":"#NAME?"},{"$error":"#NAME?"},{"$error":"#NAME?"},{"$error":"#NAME?"},{"$error":"#NAME?"},{"$error":"#NAME?"}]
{"$rows_left_out":38}
{"sheet":"A1","index":25,"n_rows":56,"n_cols":13,"rows_kept":56,"cut":false,"hidden":false,"merged":[[2,3,2,12]]}
["Assumptions Page 1 - Income Statement and Cash Flow Statement"]
[]
[null,null,null,"Projection Period"]
[null,null,null,"Year 1","Year 2","Year 3","Year 4","Year 5","Year 6","Year 7","Year 8","Year 9","Year 10"]
[null,null,null,{"$f":"TS!G25","v":{"$error":"#NAME?"}},{"$f":"D5+1","v":{"$error":"#NAME?"}},{"$error":"#NAME?"},{"$error":"#NAME?"},{"$error":"#NAME?"},{"$error":"#NAME?"},{"$error":"#NAME?"},{"$error":"#NAME?"},{"$error":"#NAME?"},{"$error":"#NAME?"}]
[]
{"$rows_left_out":51}
{"sheet":"A2","index":26,"n_rows":63,"n_cols":13,"rows_kept":63,"cut":false,"hidden":false,"merged":[[2,3,2,12]]}
["Assumptions Page 2 - Balance Sheet"]
[]
[null,null,null,"Projection Period"]
[null,null,null,"Year 1","Year 2","Year 3","Year 4","Year 5","Year 6","Year 7","Year 8","Year 9","Year 10"]
[null,null,null,{"$f":"TS!G25","v":{"$error":"#NAME?"}},{"$f":"D5+1","v":{"$error":"#NAME?"}},{"$error":"#NAME?"},{"$error":"#NAME?"},{"$error":"#NAME?"},{"$error":"#NAME?"},{"$error":"#NAME?"},{"$error":"#NAME?"},{"$error":"#NAME?"},{"$error":"#NAME?"}]
[]
{"$rows_left_out":58}
{"sheet":"A3","index":27,"n_rows":65,"n_cols":18,"rows_kept":65,"cut":false,"hidden":false,"merged":[[3,1,3,5],[35,4,35,5]]}
["Assumptions Page 3 - Financing Structures and Fees"]
[]
["Financing Structures",null,null,null,null,null,null,"Purchase Price"]
[null,"Structure",null,null,null,null,null,"Public / Private Target",null,null,null,1]
[null,1,2,3,4,5,null,"Product / Service Target",null,null,null,1]
["Source of Funds","Structure 1","Structure 2","Structure 3","Structure 4","Status Quo",null,{"$f":"IF(L4=1,\"Offer Price per Share\",\" \")","v":"Offer Price per Share"},null,null,null,18.729617941405323]
{"$rows_left_out":60}
{"sheet":"Notes","index":28,"n_rows":1,"n_cols":2,"rows_kept":1,"cut":false,"hidden":true,"merged":[]}
["Other Claims on Assets",{"$f":"IF('A3'!L4=1,_xll.BDP('P1'!B9&\" Equity\",\"OTHER NONCUR LIABS SUB DETAILED\",\"FUND PER=Y\")+_xll.BDP('P1'!B9&\" Equity\",\"OTHER CURRENT LIABS SUB DETAILED\",\"FUND PER=Y\")-_xll.BDP('P1'!B9&\" Equity\",\"BS OTHER ASSETS DEF CHRG OTHER\",\"FUND PER=Y\")-_xll.BDP('P1'!B9&\" Equity\",\"OTHER CURRENT ASSETS DETAILED\",\"FUND PER=Y\"),-(_xll.BDP('P1'!B9&\" Equity\",\"OTHER NONCUR LIABS SUB DETAILED\",\"FUND PER=Y\")+_xll.BDP('P1'!B9&\" Equity\",\"OTHER CURRENT LIABS SUB DETAILED\",\"FUND PER=Y\")-_xll.BDP('P1'!B9&\" Equity\",\"BS OTHER ASSETS DEF CHRG OTHER\",\"FUND PER=Y\")-_xll.BDP('P1'!B9&\" Equity\",\"OTHER CURRENT ASSETS DETAILED\",\"FUND PER=Y\")))","v":{"$error":"#NAME?"}}]